{"text_format":"1","workbook":"xlsx","n_sheets":5,"sheets":["datos","GRAFICO","DASH","fuentes","Hoja2"],"not_rendered":{"charts":6,"images":4,"macros":1,"external_links":0,"defined_names":0,"comments":0,"pivot_tables":6},"unopened":[],"bounds":{"document_bytes":16777216,"sheet_cells":100000,"rows_first":2000,"rows_last":500,"rows_between":2000,"halvings":0,"cell_chars":16384,"cell_head_chars":4096},"cells_cut":0,"cells_raw":0,"read":"whole","date_system":"1900"}

{"sheet":"datos","index":0,"n_rows":13,"n_cols":2,"rows_kept":13,"cut":false,"hidden":false,"merged":[]}
[2,{"$f":"VLOOKUP(A1,$A$2:$B$13,2,0)","v":"FEBRERO"}]
[1,"ENERO"]
[2,"FEBRERO"]
[3,"MARZO"]
[4,"ABRIL"]
[5,"MAYO"]
[6,"JUNIO"]
[7,"JULIO"]
[8,"AGOSTO"]
[9,"SEPTIEMBRE"]
[10,"OCTUBRE"]
[11,"NOVIEMBRE"]
[12,"DICIEMBRE"]

{"sheet":"GRAFICO","index":1,"n_rows":31,"n_cols":27,"rows_kept":31,"cut":false,"hidden":false,"merged":[[1,7,2,11],[3,7,3,11]]}
[null,null,null,null,null,null,null,null,null,null,null,null,null,null,null,null,null,null,null,null,null,null,null,null,null,null," "]
[null,null,"                      Fuente: Pharma360°",null,null,null,null,"TABLERO DE CONTROL VENTAS",null,null,null,null,null,{"$f":"+fuentes!F5","v":0.98874789739377034},null,{"$f":"+fuentes!F6","v":0.49918947379008788},null,null,null,null,null,null,null,null,null,null," "]
[null,null,"                     Análisis Gráfico por linea/Producto/Cliente",null,null,null,null,null,null,null,null,null,null,null,null,null,null,null,null,null,null,null,null,null,null,null," "]
[null,null,"                            Ult. Act.:",null,null,{"$f":"+DASH!$C$5","v":"2016-03-07T16:05:54"},null,{"$f":"+DASH!I4","v":"Selección: Inf. MENSUAL A ABRIL /Lin: (ALL) /Marca: MERC: 18-GLYCEROL/  /Cliente: (ALL)"},null,null,null,null,null,null,null,null,null,null,null,null,null,null,null,null,null,null," "]
[null,null,null,null,null,null,null," ",null,null,null,null,null,null,null,null,null,null,null,null,null,null,null,null,null,null," "]
[]
[]
[]
[null,null,{"$f":"+DASH!C9","v":"GENERAL"}]
[null,null,{"$f":"+DASH!C10","v":"SNC"}]
[null,null,{"$f":"+DASH!C11","v":"CARDIOLOGICA"}]
[null,null,{"$f":"+DASH!C12","v":"RESPIRATORIA"}]
[null,null,{"$f":"+DASH!C13","v":"METABOLICOS"}]
[null,null,{"$f":"+DASH!C14","v":"OFTALMOLOGICA"}]
[null,null,{"$f":"+DASH!C15","v":"GINECOLOCICA"}]
{"$rows_left_out":17}
{"sheet":"DASH","index":2,"n_rows":48,"n_cols":38,"rows_kept":48,"cut":false,"hidden":false,"merged":[[33,30,33,31],[33,26,33,27],[25,10,25,12],[26,10,26,12],[27,10,27,12],[28,10,28,12],[29,10,29,12],[33,8,33,9],[17,15,17,16],[7,15,7,16],[33,15,33,16],[33,11,33,12],[7,10,7,12],[8,10,8,12],[9,10,9,12],[10,10,10,12],[11,10,11,12],[12,10,12,12],[13,10,13,12],[14,10,14,12],[20,10,20,12],[21,10,21,12],[22,10,22,12],[1,20,2,21],[1,10,2,18],[1,22,2,22],[32,20,32,28],[4,2,4,4],[15,10,15,12],[17,10,17,12],[18,10,18,12],[19,10,19,12],[3,8,3,19],[7,8,7,9],[17,8,17,9],[23,10,23,12],[24,10,24,12],[30,10,30,12],[43,21,43,22],[43,27,43,28],[43,31,43,32],[43,29,43,30],[43,23,43,24],[43,25,43,26]]}
[null,null,null,null,null,null,null,null,null,null,null,null,null,null,null,null,null,null,null,null,null,null,null,null,null,null,null,null,null," "]
[null,null,"                          Fuente: Pharma360°",null,null,null,null,null,null,null,"TABLERO DE CONTROL VENTAS ",null,null,null,null,null,null,null,null,null,{"$f":"+fuentes!F5","v":0.98874789739377034},null,{"$f":"+fuentes!F6","v":0.49918947379008788},null,null,null,null,null,null," "]
[null,null,"                          Análisis por linea/Producto/Cliente",null,null,null,null,null,null,null,null,null,null,null,null,null,null,null,null,null,null,null,null,null,null,null,null,null,null," "]
[null,null,"                            Ult. Act.:",null,null,null,null,null,{"$f":"\"Selección: Inf. \"&fuentes!C30&\" /Lin: \"&fuentes!Y2&\" /Marca: \"&fuentes!Y3&\"/\"&fuentes!AA4&\" /Cliente: \"&fuentes!Y5","v":"Selección: Inf. MENSUAL A ABRIL /Lin: (ALL) /Marca: MERC: 18-GLYCEROL/  /Cliente: (ALL)"},null,null,null,null,null,null,null,null,null,null,null,null,null,null,null,null,null,null,null,null," ",null,null,null,null,null,null," "]
[null,null,"2016-03-07T16:05:54",null,null,null,null,null,null,null,null,null,null,null,{"$f":"\"Año actual : \"&fuentes!C6","v":"Año actual : 2016"},null,null,null,null,null,null,null,null,null,null,null,null,null,null," ",null,null,null,null,null,null,{"$f":"100%-AL5","v":1.1252102606229664E-2},{"$f":"+fuentes!F5","v":0.98874789739377034}]
[null,null,null,null,null,null,null," ",null,null,null,null,null,null,null,null,null,null,null,null,null,null,null,null,null,null,null,null,null,null,null,null,null,null,null,null,1]
[null,null,null,null,null,null,null,null,null,null,null,null,null,null,null,null,null,null,null,null,null,null,null,null,null,null,null,null,null,null,null,null,null,null,null,null,0]
[null,null,"LINEAS","PLAN (U)","VTA (U)","  VTA (U) BONIF."," TOT  VTA (U)"," %BONI. (U)","%CUM (U)",null,"FCST (U)",null,null," PLAN ($)"," VTA ($)","%CUM ($)",null,"NUR PLAN","NUR VTA"]
[null,null,{"$f":"fuentes!H12","v":"GENERAL"},{"$f":"IFERROR((VLOOKUP($C9,fuentes!$H$11:$P$19,2,0)),\" \")","v":60317.379999999903},{"$f":"IFERROR((VLOOKUP($C9,fuentes!$H$11:$P$19,3,0)),\" \")","v":60079.620000000032},{"$f":"IFERROR((VLOOKUP($C9,fuentes!$H$11:$P$19,4,0)),\" \")","v":60027.390000000036},{"$f":"IFERROR((VLOOKUP($C9,fuentes!$H$11:$P$19,5,0)),\" \")","v":120107.01000000007},{"$f":"IFERROR((VLOOKUP($C9,fuentes!$H$11:$P$19,6,0)),\" \")","v":0.99913065362264286},{"$f":"IFERROR((+E9/D9),0)","v":0.99605818422484749},{"$f":"IFERROR((+E9/D9),0)","v":0.99605818422484749},{"$f":"IF(fuentes!$B$14=1,\" \",SUMIF(#REF!,DASH!C9,#REF!))","v":" "},null,null,{"$f":"IFERROR((VLOOKUP($C9,fuentes!$H$11:$P$19,7,0)),\" \")","v":60376.259999999886},{"$f":"IFERROR((VLOOKUP($C9,fuentes!$H$11:$P$19,8,0)),\" \")","v":60578.490000000049},{"$f":"IFERROR((+O9/N9),0)","v":1.0033494953148832},{"$f":"IFERROR((+O9/N9),0)","v":1.0033494953148832},{"$f":"IFERROR((VLOOKUP($C9,fuentes!$H$11:$Q$19,10,0)),\" \")","v":0},{"$f":"IFERROR((+O9/G9),0)","v":0.50437097718109891}]
[null,null,{"$f":"fuentes!H13","v":"SNC"},{"$f":"IFERROR((VLOOKUP($C10,fuentes!$H$11:$P$19,2,0)),\" \")","v":51903.69999999999},{"$f":"IFERROR((VLOOKUP($C10,fuentes!$H$11:$P$19,3,0)),\" \")","v":51695.510000000089},{"$f":"IFERROR((VLOOKUP($C10,fuentes!$H$11:$P$19,4,0)),\" \")","v":51834.289999999892},{"$f":"IFERROR((VLOOKUP($C10,fuentes!$H$11:$P$19,5,0)),\" \")","v":103529.79999999999},{"$f":"IFERROR((VLOOKUP($C10,fuentes!$H$11:$P$19,6,0)),\" \")","v":1.0026845658355978},{"$f":"IFERROR((+E10/D10),0)","v":0.99598891793841482},0.99598891793841482,{"$f":"IF(fuentes!$B$14=1,\" \",SUMIF(#REF!,DASH!C10,#REF!))","v":" "},null,null,{"$f":"IFERROR((VLOOKUP($C10,fuentes!$H$11:$P$19,7,0)),\" \")","v":52145.900000000009},{"$f":"IFERROR((VLOOKUP($C10,fuentes!$H$11:$P$19,8,0)),\" \")","v":51317.46},{"$f":"IFERROR((+O10/N10),0)","v":0.98411303669128336},{"$f":"IFERROR((+O10/N10),0)","v":0.98411303669128336},{"$f":"IFERROR((VLOOKUP($C10,fuentes!$H$11:$Q$19,10,0)),\" \")","v":0},{"$f":"IFERROR((+O10/G10),0)","v":0.49567815257056425}]
[null,null,{"$f":"fuentes!H14","v":"CARDIOLOGICA"},{"$f":"IFERROR((VLOOKUP($C11,fuentes!$H$11:$P$19,2,0)),\" \")","v":37070.969999999994},{"$f":"IFERROR((VLOOKUP($C11,fuentes!$H$11:$P$19,3,0)),\" \")","v":36668.400000000045},{"$f":"IFERROR((VLOOKUP($C11,fuentes!$H$11:$P$19,4,0)),\" \")","v":36609.32},{"$f":"IFERROR((VLOOKUP($C11,fuentes!$H$11:$P$19,5,0)),\" \")","v":73277.720000000045},{"$f":"IFERROR((VLOOKUP($C11,fuentes!$H$11:$P$19,6,0)),\" \")","v":0.99838880343838166},0.98914055931096623,0.98914055931096623,{"$f":"IF(fuentes!$B$14=1,\" \",SUMIF(#REF!,DASH!C11,#REF!))","v":" "},null,null,{"$f":"IFERROR((VLOOKUP($C11,fuentes!$H$11:$P$19,7,0)),\" \")","v":37124.57},{"$f":"IFERROR((VLOOKUP($C11,fuentes!$H$11:$P$19,8,0)),\" \")","v":36579.439999999959},0.98531619356129807,0.98531619356129807,{"$f":"IFERROR((VLOOKUP($C11,fuentes!$H$11:$Q$19,10,0)),\" \")","v":0},0.49918911232500052]
[null,null,{"$f":"fuentes!H15","v":"RESPIRATORIA"},{"$f":"IFERROR((VLOOKUP($C12,fuentes!$H$11:$P$19,2,0)),\" \")","v":15992.440000000013},{"$f":"IFERROR((VLOOKUP($C12,fuentes!$H$11:$P$19,3,0)),\" \")","v":15404.669999999998},{"$f":"IFERROR((VLOOKUP($C12,fuentes!$H$11:$P$19,4,0)),\" \")","v":15404.259999999995},{"$f":"IFERROR((VLOOKUP($C12,fuentes!$H$11:$P$19,5,0)),\" \")","v":30808.929999999993},{"$f":"IFERROR((VLOOKUP($C12,fuentes!$H$11:$P$19,6,0)),\" \")","v":0.99997338469438146},0.96324700921185169,0.96324700921185169,{"$f":"IF(fuentes!$B$14=1,\" \",SUMIF(#REF!,DASH!C12,#REF!))","v":" "},null,null,{"$f":"IFERROR((VLOOKUP($C12,fuentes!$H$11:$P$19,7,0)),\" \")","v":15916.639999999998},{"$f":"IFERROR((VLOOKUP($C12,fuentes!$H$11:$P$19,8,0)),\" \")","v":15334.720000000012},0.96343951989867294,0.96343951989867294,{"$f":"IFERROR((VLOOKUP($C12,fuentes!$H$11:$Q$19,10,0)),\" \")","v":0},0.4977362083006458]
[null,null,{"$f":"fuentes!H16","v":"METABOLICOS"},{"$f":"IFERROR((VLOOKUP($C13,fuentes!$H$11:$P$19,2,0)),\" \")","v":11913.540000000003},{"$f":"IFERROR((VLOOKUP($C13,fuentes!$H$11:$P$19,3,0)),\" \")","v":11981.190000000004},{"$f":"IFERROR((VLOOKUP($C13,fuentes!$H$11:$P$19,4,0)),\" \")","v":11746.360000000008},{"$f":"IFERROR((VLOOKUP($C13,fuentes!$H$11:$P$19,5,0)),\" \")","v":23727.55000000001},{"$f":"IFERROR((VLOOKUP($C13,fuentes!$H$11:$P$19,6,0)),\" \")","v":0.98040011050655262},1.0056784129654159,1.0056784129654159,{"$f":"IF(fuentes!$B$14=1,\" \",SUMIF(#REF!,DASH!C13,#REF!))","v":" "},null,null,{"$f":"IFERROR((VLOOKUP($C13,fuentes!$H$11:$P$19,7,0)),\" \")","v":11970.120000000004},{"$f":"IFERROR((VLOOKUP($C13,fuentes!$H$11:$P$19,8,0)),\" \")","v":11737.220000000007},0.98054321928268073,0.98054321928268073,{"$f":"IFERROR((VLOOKUP($C13,fuentes!$H$11:$Q$19,10,0)),\" \")","v":0},0.49466632669618238]
[null,null,{"$f":"fuentes!H17","v":"OFTALMOLOGICA"},{"$f":"IFERROR((VLOOKUP($C14,fuentes!$H$11:$P$19,2,0)),\" \")","v":6433.4600000000037},{"$f":"IFERROR((VLOOKUP($C14,fuentes!$H$11:$P$19,3,0)),\" \")","v":6438.4200000000028},{"$f":"IFERROR((VLOOKUP($C14,fuentes!$H$11:$P$19,4,0)),\" \")","v":6493.9499999999989},{"$f":"IFERROR((VLOOKUP($C14,fuentes!$H$11:$P$19,5,0)),\" \")","v":12932.370000000003},{"$f":"IFERROR((VLOOKUP($C14,fuentes!$H$11:$P$19,6,0)),\" \")","v":1.008624786826581},1.0007709692762525,1.0007709692762525,{"$f":"IF(fuentes!$B$14=1,\" \",SUMIF(#REF!,DASH!C14,#REF!))","v":" "},null,null,{"$f":"IFERROR((VLOOKUP($C14,fuentes!$H$11:$P$19,7,0)),\" \")","v":6501.2800000000025},{"$f":"IFERROR((VLOOKUP($C14,fuentes!$H$11:$P$19,8,0)),\" \")","v":6469.8899999999967},0.99517172003051613,0.99517172003051613,{"$f":"IFERROR((VLOOKUP($C14,fuentes!$H$11:$Q$19,10,0)),\" \")","v":0},0.50028649041126994]
[null,null,{"$f":"fuentes!H18","v":"GINECOLOCICA"},{"$f":"IFERROR((VLOOKUP($C15,fuentes!$H$11:$P$19,2,0)),\" \")","v":4720.6499999999996},{"$f":"IFERROR((VLOOKUP($C15,fuentes!$H$11:$P$19,3,0)),\" \")","v":4686.1000000000031},{"$f":"IFERROR((VLOOKUP($C15,fuentes!$H$11:$P$19,4,0)),\" \")","v":4749.3999999999969},{"$f":"IFERROR((VLOOKUP($C15,fuentes!$H$11:$P$19,5,0)),\" \")","v":9435.5},{"$f":"IFERROR((VLOOKUP($C15,fuentes!$H$11:$P$19,6,0)),\" \")","v":1.0135080343996061},0.99268109264614057,0.99268109264614057,{"$f":"IF(fuentes!$B$14=1,\" \",SUMIF(#REF!,DASH!C15,#REF!))","v":" "},null,null,{"$f":"IFERROR((VLOOKUP($C15,fuentes!$H$11:$P$19,7,0)),\" \")","v":4695.29},{"$f":"IFERROR((VLOOKUP($C15,fuentes!$H$11:$P$19,8,0)),\" \")","v":4589.2300000000032},0.97741140589825193,0.97741140589825193,{"$f":"IFERROR((VLOOKUP($C15,fuentes!$H$11:$Q$19,10,0)),\" \")","v":0},0.48637910020666664]
{"$rows_left_out":34}
{"sheet":"fuentes","index":3,"n_rows":279,"n_cols":58,"rows_kept":279,"cut":false,"hidden":false,"merged":[[5,9,7,10],[4,0,5,0],[0,0,0,2],[1,0,1,2]]}
["MANTENER FORMULAS",null,null,null,null,null,null,null,null,null,null,null,null,null,null,null,null,null,null,null,null,null,null,"SELECCIÓN SIN DISTRIB",{"$f":"IF(Z1=0,\"(ALL)\",AB2&AB3&AB4)","v":"MERC: 18-GLYCEROL"},{"$f":"SUM(Z2:Z5)","v":3},null," ",null,null,"ENERO","FEBRERO","MARZO","ABRIL","MAYO","JUNIO","JULIO","AGOSTO","SEPTIEMBRE","OCTUBRE","NOVIEMBRE","DICIEMBRE","Total general"]
["DATOS PARA CAMBIAR ANUALMENTE",null,null,null,null,null,null,null,null,null,null,null,null,null,null,null,null,null,null,null,null,null,null,"LINEA","(ALL)",{"$f":"IF(Y2=\"(ALL)\",0,1)","v":0},null,{"$f":"IF(Z2<>0,Y2,\"\")","v":""}]
[null,null,null,null,null,null,null,null,null,null,null,null,null,null,null,null,null,null,null,null,null,null,null,"MARCA","MERC: 18-GLYCEROL",{"$f":"IF(Y3=\"(ALL)\",0,3)","v":3},null,{"$f":"IF(Z3<>0,Y3,\"\")","v":"MERC: 18-GLYCEROL"}]
[null,null,null,null,null,null,null,null,null,null,"TAB1",null,null,null,null,null,null,null,null,null,null,null,null,"COD_ITEM","(ALL)",{"$f":"IF(Y4=\"(ALL)\",0,5)","v":0}," ",{"$f":"IF(AA4<>\" \",Y4,\"\")","v":""}]
["DATOS PARA CAMBIO DE AÑO","AÑO BASE",2015,null,"%CUM",{"$f":"IF(B14=1,(IF(Y2=\"(ALL)\",DASH!P16,(VLOOKUP(fuentes!Y2,DASH!$C$9:$S$16,14,0)))),(IF(Y2=\"(ALL)\",DASH!I16,(VLOOKUP(fuentes!Y2,DASH!$C$9:$S$17,7,0)))))","v":0.98874789739377034},null,null,null,null,null," ",null,null,null,null,null,null,null,null,null,null,null,"CLIENTE","(ALL)",0,null,null,null,null,null,"TAB5"]
[null,"AÑO ACTUAL",2016,null,"NUR",{"$f":"IF(Y2=\"(ALL)\",DASH!S16,(VLOOKUP(fuentes!Y2,DASH!$C$9:$S$16,17,0)))","v":0.49918947379008788},null,"ANIO",2016,null,null,null,null,null,null,null,null,null,null,null,null,null,null,"LIN+MAR",4,null,null,null,"CLIENTE","(Todas)"]
[null,null,null,null,null,null,null,"MES","abril",null,null,null,null,null,null,null,null,null,null,null,null,null,null,"LIN+MAR+ITE",9,"I271 I500",null,null,"LINEA","(Varios elementos)"]
[null,null,null,null,null,null,null,"CLIENTE","(Todas)",null,null,null,null,null,null,null,null,null,null,null,null,null,null,"LIN+ITEM",6,"H271 H500",null,null,"PRODUCTO","MERC: 18-GLYCEROL"]
[null,null,null,null,null,null,null,null,null,null,null,null,null,null,null,null,null,null,null,null,null,null,null,"MAR+ITEM",8,"G271 G500",null,null,"COD_ITEM","(Todas)",null,{"$f":"IF(AD9<>\"(Todas)\",(MID(AD9,(FIND(\"(\",AD9)+1),(LEN(AD9))-(FIND(\"(\",AD9)+1))),\"(ALL)\")","v":"(ALL)"}," "]
[null,null,null,null,null,null,null,null,"Valores",null,null,null,null,null,null,null,null,null,null,null,null,null,null,"TODO",0," TOTAL"]
[null,null,null,null,null,null,1,"Rótulos de fila","UNI PLAN"," UNI NET"," UNI BONIF."," TOT UNI"," %Bonif."," VALOR PLAN"," VENTA ($)"," P_PROM",{"$f":"IFERROR((+N11/R11),0)","v":0},{"$f":"SUMIF($K$289:$K$427,H11,$F$289:$F$427)","v":0},null,null,null,null,null,"SOLO LINEA",1,"K271 K500",null,null,null,null,"MES"]
[null,null,null,null,null,null,{"$f":"+G11+1","v":2},"GENERAL",60317.379999999903,60079.620000000032,60027.390000000036,120107.01000000007,0.99913065362264286,60376.259999999886,60578.490000000049,0.50437097718109891,{"$f":"IFERROR((+N12/R12),0)","v":0},0,null,null,null,null,null,null,null,null,null,null,"ANIO","Valores","enero","febrero","marzo","abril","mayo","junio","julio","agosto","septiembre","Octubre","Noviembre","diciembre","Total general",null," ","ENE","FEB","MAR","ABR","MAY","JUN","JUL","AGO","SEP","OCT","NOV","DIC","TOTAL"]
[null,null,null,null,null,null,{"$f":"+G12+1","v":3},"SNC",51903.69999999999,51695.510000000089,51834.289999999892,103529.79999999999,1.0026845658355978,52145.900000000009,51317.46,0.49567815257056425,0,0,null,null,null,null,null,"NO BORRAR",null,null,null,{"$f":"+AC13&AD13","v":"2015 VALOR_PLAN"},2015," VALOR_PLAN",1.31,1.1499999999999999,1.1100000000000001,619.17999999999995,1.1200000000000001,642.98,624.46,610.4,1073.51,1013.3,814.8,695.41,6098.7300000000005]
[null,1,null,null,1,null,4,"CARDIOLOGICA",37070.969999999994,36668.400000000045,36609.32,73277.720000000045,0.99838880343838166,37124.57,36579.439999999959,0.49918911232500052,0,0,null,null,null,null,null,{"$f":"fuentes!C5&\" VALOR_VENTA_NETO\"","v":"2015 VALOR_VENTA_NETO"},null,null,null,{"$f":"+AC14&AD14","v":" VALOR_VENTA_NETO"},null," VALOR_VENTA_NETO",1.48,1.01,3.89,666.5,2.5299999999999998,692.94,665.5,648.33000000000004,1027.94,600.79,788.73,679.96,5779.5999999999995]
[1,"USD$ /.000",null,null,1,"ABSOLUTOS",5,"RESPIRATORIA",15992.440000000013,15404.669999999998,15404.259999999995,30808.929999999993,0.99997338469438146,15916.639999999998,15334.720000000012,0.4977362083006458,0,0,null,null,null,null,null,{"$f":"fuentes!C6&\" VALOR_PLAN\"","v":"2016 VALOR_PLAN"},null,null,null,{"$f":"+AC15&AD15","v":" UNIDADES_PLAN"},null," UNIDADES_PLAN",5.55,8.4600000000000009,1.38,709.81,1.97,666.93,648.39,611.61,1057.8900000000001,1048.31,824.38,691.37,6276.0499999999993,null,{"$f":"IF(B14=1,+DASH!U19,DASH!$U$23)","v":"Vta ($)  2015"},{"$f":"IF($B$14=1,+DASH!V19/1000,DASH!V23)","v":{"$error":"#N/A"}},{"$f":"IF($B$14=1,+DASH!W19/1000,DASH!W23)","v":{"$error":"#N/A"}},{"$f":"IF($B$14=1,+DASH!X19/1000,DASH!X23)","v":{"$error":"#N/A"}},{"$f":"IF($B$14=1,+DASH!Y19/1000,DASH!Y23)","v":{"$error":"#N/A"}},{"$f":"IF($B$14=1,+DASH!Z19/1000,DASH!Z23)","v":{"$error":"#N/A"}},{"$f":"IF($B$14=1,+DASH!AA19/1000,DASH!AA23)","v":{"$error":"#N/A"}},{"$f":"IF($B$14=1,+DASH!AB19/1000,DASH!AB23)","v":{"$error":"#N/A"}},{"$f":"IF($B$14=1,+DASH!AC19/1000,DASH!AC23)","v":{"$error":"#N/A"}},{"$f":"IF($B$14=1,+DASH!AD19/1000,DASH!AD23)","v":{"$error":"#N/A"}},{"$f":"IF($B$14=1,+DASH!AE19/1000,DASH!AE23)","v":{"$error":"#N/A"}},{"$f":"IF($B$14=1,+DASH!AF19/1000,DASH!AF23)","v":{"$error":"#N/A"}},{"$f":"IF($B$14=1,+DASH!AG19/1000,DASH!AG23)","v":{"$error":"#N/A"}},{"$f":"SUM(AT15:BE15)","v":{"$error":"#N/A"}}]
{"$rows_left_out":265}
{"sheet":"Hoja2","index":4,"n_rows":8,"n_cols":2,"rows_kept":8,"cut":false,"hidden":false,"merged":[]}
["ANIMUS","LINEA_ALFA"]
["DISCONTINUADOS","LINEA_BETA"]
["FORTIA","Linea"]
["NOVUS"]
["OPTIMUN"]
["OTROS PROD"]
["SIGNUM"]
["TEMPUS"]